{"text_format":"1","workbook":"xlsx","n_sheets":3,"sheets":["SAMPLES","MEASUREMENTS","Time constants"],"not_rendered":{"charts":0,"images":0,"macros":1,"external_links":0,"defined_names":1,"comments":0,"pivot_tables":0},"unopened":[],"bounds":{"document_bytes":16777216,"sheet_cells":100000,"rows_first":2000,"rows_last":500,"rows_between":2000,"halvings":0,"cell_chars":16384,"cell_head_chars":4096},"cells_cut":0,"cells_raw":0,"read":"whole","date_system":"1900"}

{"sheet":"SAMPLES","index":0,"n_rows":9,"n_cols":13,"rows_kept":9,"cut":false,"hidden":false,"merged":[]}
[]
[]
[null,"IPTS number"]
[null,"PI and PI's email"]
[null,null,null,null,"Lattice constants"]
[null,"Sample Name","Chemical Formula (e.g. H2O)","mass (g)","a (Å)","b (Å)","c (Å)","α (deg)","β (deg)","γ (deg)","Z","Solid density (g/cm^3)","ITEMS"]
[null,"Sample 1 Name"]
[null,"Sample 2 Name"]
[null,"Sample 3 Name"]

{"sheet":"MEASUREMENTS","index":1,"n_rows":106,"n_cols":11,"rows_kept":106,"cut":false,"hidden":false,"merged":[]}
[]
[]
[]
[null,null,null,null,null,null,null,null,"Maximum Measurement time (hours)",24]
["NOTES","Temp. (K)  (5 to 320 K)","Sample","Incident Energy (meV)","High Flux / High Res","Time to measure (Coulombs)  (4.9 C/hour at 1.4 MW)","Time to set Temperature (minutes)","Time to set Config. (minutes)","Elapsed Time for commands (minutes)","Total Elapsed time (hours)","Putative Title"]
["INITIAL CONFIGURATION",290,null,60,"High Flux"]
["Example 1",5,"Sample 1 Name",60,"High Flux",12,{"$f":"IF(IF($B7>0,$B7-INDEX($B:$B,_xlfn.AGGREGATE(14,6,1/(LEN($B$1:INDEX(B:B,ROW()-1))>0)*ROW(B:B),1)),\"\")<>\"\",     ABS(IF($B7>0,$B7-INDEX($B:$B,_xlfn.AGGREGATE(14,6,1/(LEN($B$1:INDEX(B:B,ROW()-1))>0)*ROW(B:B),1)),\"\"))/'Time constants'!$C$8+IF(B7=B6,0,1)*'Time constants'!$C$7,\"\")","v":91.509316770186331},{"$f":"IF(OR(E7=\"High Resolution\",E7=\"High Flux\"),IF(E7=E6,0,1)*'Time constants'!$C$5+IF(D7=D6,0,1)*'Time constants'!$C$4,\"\")","v":0},{"$f":"IF(IF(F7=\"\",0,F7/'Time constants'!$C$6)+IF(G7=\"\",0,G7)+IF(H7=\"\",0,H7)=0,\"\",IF(F7=\"\",0,F7/'Time constants'!$C$6)+IF(G7=\"\",0,G7)+IF(H7=\"\",0,H7))","v":238.4480922803904},{"$f":"IF(I7/60=\"\",\"\",I7/60)","v":3.9741348713398401},{"$f":"IF(C7=\"\",\"\",TEXT(C7,\"0\") &\", \" & TEXT(E7,\"0\") & \" \" & TEXT(D7,\"0.0\") & \" meV, \" & \"T=\" & TEXT(B7,\"0.00\") & \" K, \" &TEXT(F7,\"0.00\") & \"C\")","v":"Sample 1 Name, High Flux 60.0 meV, T=5.00 K, 12.00C"}]
["Example 2",5,"Sample 2 Name",60,"High Flux",12,{"$f":"IF(IF($B8>0,$B8-INDEX($B:$B,_xlfn.AGGREGATE(14,6,1/(LEN($B$1:INDEX(B:B,ROW()-1))>0)*ROW(B:B),1)),\"\")<>\"\",     ABS(IF($B8>0,$B8-INDEX($B:$B,_xlfn.AGGREGATE(14,6,1/(LEN($B$1:INDEX(B:B,ROW()-1))>0)*ROW(B:B),1)),\"\"))/'Time constants'!$C$8+IF(B8=B7,0,1)*'Time constants'!$C$7,\"\")","v":0},{"$f":"IF(OR(E8=\"High Resolution\",E8=\"High Flux\"),IF(E8=E7,0,1)*'Time constants'!$C$5+IF(D8=D7,0,1)*'Time constants'!$C$4,\"\")","v":0},{"$f":"IF(IF(F8=\"\",0,F8/'Time constants'!$C$6)+IF(G8=\"\",0,G8)+IF(H8=\"\",0,H8)=0,\"\",IF(F8=\"\",0,F8/'Time constants'!$C$6)+IF(G8=\"\",0,G8)+IF(H8=\"\",0,H8))","v":146.93877551020407},{"$f":"IF(I8=\"\",\"\",I8/60+J7)","v":6.4231144631765744},{"$f":"IF(C8=\"\",\"\",TEXT(C8,\"0\") &\", \" & TEXT(E8,\"0\") & \" \" & TEXT(D8,\"0.0\") & \" meV, \" & \"T=\" & TEXT(B8,\"0.00\") & \" K, \" &TEXT(F8,\"0.00\") & \"C\")","v":"Sample 2 Name, High Flux 60.0 meV, T=5.00 K, 12.00C"}]
["Example 3",5,"Sample 3 Name",60,"High Flux",12,{"$f":"IF(IF($B9>0,$B9-INDEX($B:$B,_xlfn.AGGREGATE(14,6,1/(LEN($B$1:INDEX(B:B,ROW()-1))>0)*ROW(B:B),1)),\"\")<>\"\",     ABS(IF($B9>0,$B9-INDEX($B:$B,_xlfn.AGGREGATE(14,6,1/(LEN($B$1:INDEX(B:B,ROW()-1))>0)*ROW(B:B),1)),\"\"))/'Time constants'!$C$8+IF(B9=B8,0,1)*'Time constants'!$C$7,\"\")","v":0},{"$f":"IF(OR(E9=\"High Resolution\",E9=\"High Flux\"),IF(E9=E8,0,1)*'Time constants'!$C$5+IF(D9=D8,0,1)*'Time constants'!$C$4,\"\")","v":0},{"$f":"IF(IF(F9=\"\",0,F9/'Time constants'!$C$6)+IF(G9=\"\",0,G9)+IF(H9=\"\",0,H9)=0,\"\",IF(F9=\"\",0,F9/'Time constants'!$C$6)+IF(G9=\"\",0,G9)+IF(H9=\"\",0,H9))","v":146.93877551020407},8.8720940550133083,{"$f":"IF(C9=\"\",\"\",TEXT(C9,\"0\") &\", \" & TEXT(E9,\"0\") & \" \" & TEXT(D9,\"0.0\") & \" meV, \" & \"T=\" & TEXT(B9,\"0.00\") & \" K, \" &TEXT(F9,\"0.00\") & \"C\")","v":"Sample 3 Name, High Flux 60.0 meV, T=5.00 K, 12.00C"}]
["Example 4",120,"Sample 1 Name",120,"High Resolution",24,{"$f":"IF(IF($B10>0,$B10-INDEX($B:$B,_xlfn.AGGREGATE(14,6,1/(LEN($B$1:INDEX(B:B,ROW()-1))>0)*ROW(B:B),1)),\"\")<>\"\",     ABS(IF($B10>0,$B10-INDEX($B:$B,_xlfn.AGGREGATE(14,6,1/(LEN($B$1:INDEX(B:B,ROW()-1))>0)*ROW(B:B),1)),\"\"))/'Time constants'!$C$8+IF(B10=B9,0,1)*'Time constants'!$C$7,\"\")","v":38.714285714285715},{"$f":"IF(OR(E10=\"High Resolution\",E10=\"High Flux\"),IF(E10=E9,0,1)*'Time constants'!$C$5+IF(D10=D9,0,1)*'Time constants'!$C$4,\"\")","v":20},{"$f":"IF(IF(F10=\"\",0,F10/'Time constants'!$C$6)+IF(G10=\"\",0,G10)+IF(H10=\"\",0,H10)=0,\"\",IF(F10=\"\",0,F10/'Time constants'!$C$6)+IF(G10=\"\",0,G10)+IF(H10=\"\",0,H10))","v":352.59183673469386},14.748624667258206,{"$f":"IF(C10=\"\",\"\",TEXT(C10,\"0\") &\", \" & TEXT(E10,\"0\") & \" \" & TEXT(D10,\"0.0\") & \" meV, \" & \"T=\" & TEXT(B10,\"0.00\") & \" K, \" &TEXT(F10,\"0.00\") & \"C\")","v":"Sample 1 Name, High Resolution 120.0 meV, T=120.00 K, 24.00C"}]
["Example 5",120,"Sample 2 Name",120,"High Resolution",24,{"$f":"IF(IF($B11>0,$B11-INDEX($B:$B,_xlfn.AGGREGATE(14,6,1/(LEN($B$1:INDEX(B:B,ROW()-1))>0)*ROW(B:B),1)),\"\")<>\"\",     ABS(IF($B11>0,$B11-INDEX($B:$B,_xlfn.AGGREGATE(14,6,1/(LEN($B$1:INDEX(B:B,ROW()-1))>0)*ROW(B:B),1)),\"\"))/'Time constants'!$C$8+IF(B11=B10,0,1)*'Time constants'!$C$7,\"\")","v":0},{"$f":"IF(OR(E11=\"High Resolution\",E11=\"High Flux\"),IF(E11=E10,0,1)*'Time constants'!$C$5+IF(D11=D10,0,1)*'Time constants'!$C$4,\"\")","v":0},{"$f":"IF(IF(F11=\"\",0,F11/'Time constants'!$C$6)+IF(G11=\"\",0,G11)+IF(H11=\"\",0,H11)=0,\"\",IF(F11=\"\",0,F11/'Time constants'!$C$6)+IF(G11=\"\",0,G11)+IF(H11=\"\",0,H11))","v":293.87755102040813},19.646583850931673,"Sample 2 Name, High Resolution 120.0 meV, T=120.00 K, 24.00C"]
["Example 6",120,"Sample 3 Name",120,"High Resolution",24,{"$f":"IF(IF($B12>0,$B12-INDEX($B:$B,_xlfn.AGGREGATE(14,6,1/(LEN($B$1:INDEX(B:B,ROW()-1))>0)*ROW(B:B),1)),\"\")<>\"\",     ABS(IF($B12>0,$B12-INDEX($B:$B,_xlfn.AGGREGATE(14,6,1/(LEN($B$1:INDEX(B:B,ROW()-1))>0)*ROW(B:B),1)),\"\"))/'Time constants'!$C$8+IF(B12=B11,0,1)*'Time constants'!$C$7,\"\")","v":0},{"$f":"IF(OR(E12=\"High Resolution\",E12=\"High Flux\"),IF(E12=E11,0,1)*'Time constants'!$C$5+IF(D12=D11,0,1)*'Time constants'!$C$4,\"\")","v":0},{"$f":"IF(IF(F12=\"\",0,F12/'Time constants'!$C$6)+IF(G12=\"\",0,G12)+IF(H12=\"\",0,H12)=0,\"\",IF(F12=\"\",0,F12/'Time constants'!$C$6)+IF(G12=\"\",0,G12)+IF(H12=\"\",0,H12))","v":293.87755102040813},24.544543034605141,"Sample 3 Name, High Resolution 120.0 meV, T=120.00 K, 24.00C"]
[null,null,null,null,null,null,{"$f":"IF(IF($B13>0,$B13-INDEX($B:$B,_xlfn.AGGREGATE(14,6,1/(LEN($B$1:INDEX(B:B,ROW()-1))>0)*ROW(B:B),1)),\"\")<>\"\",     ABS(IF($B13>0,$B13-INDEX($B:$B,_xlfn.AGGREGATE(14,6,1/(LEN($B$1:INDEX(B:B,ROW()-1))>0)*ROW(B:B),1)),\"\"))/'Time constants'!$C$8+IF(B13=B12,0,1)*'Time constants'!$C$7,\"\")","v":""},{"$f":"IF(OR(E13=\"High Resolution\",E13=\"High Flux\"),IF(E13=E12,0,1)*'Time constants'!$C$5+IF(D13=D12,0,1)*'Time constants'!$C$4,\"\")","v":""},{"$f":"IF(IF(F13=\"\",0,F13/'Time constants'!$C$6)+IF(G13=\"\",0,G13)+IF(H13=\"\",0,H13)=0,\"\",IF(F13=\"\",0,F13/'Time constants'!$C$6)+IF(G13=\"\",0,G13)+IF(H13=\"\",0,H13))","v":""},"",""]
[null,null,null,null,null,null,{"$f":"IF(IF($B14>0,$B14-INDEX($B:$B,_xlfn.AGGREGATE(14,6,1/(LEN($B$1:INDEX(B:B,ROW()-1))>0)*ROW(B:B),1)),\"\")<>\"\",     ABS(IF($B14>0,$B14-INDEX($B:$B,_xlfn.AGGREGATE(14,6,1/(LEN($B$1:INDEX(B:B,ROW()-1))>0)*ROW(B:B),1)),\"\"))/'Time constants'!$C$8+IF(B14=B13,0,1)*'Time constants'!$C$7,\"\")","v":""},{"$f":"IF(OR(E14=\"High Resolution\",E14=\"High Flux\"),IF(E14=E13,0,1)*'Time constants'!$C$5+IF(D14=D13,0,1)*'Time constants'!$C$4,\"\")","v":""},{"$f":"IF(IF(F14=\"\",0,F14/'Time constants'!$C$6)+IF(G14=\"\",0,G14)+IF(H14=\"\",0,H14)=0,\"\",IF(F14=\"\",0,F14/'Time constants'!$C$6)+IF(G14=\"\",0,G14)+IF(H14=\"\",0,H14))","v":""},"",""]
[null,null,null,null,null,null,{"$f":"IF(IF($B15>0,$B15-INDEX($B:$B,_xlfn.AGGREGATE(14,6,1/(LEN($B$1:INDEX(B:B,ROW()-1))>0)*ROW(B:B),1)),\"\")<>\"\",     ABS(IF($B15>0,$B15-INDEX($B:$B,_xlfn.AGGREGATE(14,6,1/(LEN($B$1:INDEX(B:B,ROW()-1))>0)*ROW(B:B),1)),\"\"))/'Time constants'!$C$8+IF(B15=B14,0,1)*'Time constants'!$C$7,\"\")","v":""},{"$f":"IF(OR(E15=\"High Resolution\",E15=\"High Flux\"),IF(E15=E14,0,1)*'Time constants'!$C$5+IF(D15=D14,0,1)*'Time constants'!$C$4,\"\")","v":""},{"$f":"IF(IF(F15=\"\",0,F15/'Time constants'!$C$6)+IF(G15=\"\",0,G15)+IF(H15=\"\",0,H15)=0,\"\",IF(F15=\"\",0,F15/'Time constants'!$C$6)+IF(G15=\"\",0,G15)+IF(H15=\"\",0,H15))","v":""},"",""]
[null,null,null,null,null,null,{"$f":"IF(IF($B16>0,$B16-INDEX($B:$B,_xlfn.AGGREGATE(14,6,1/(LEN($B$1:INDEX(B:B,ROW()-1))>0)*ROW(B:B),1)),\"\")<>\"\",     ABS(IF($B16>0,$B16-INDEX($B:$B,_xlfn.AGGREGATE(14,6,1/(LEN($B$1:INDEX(B:B,ROW()-1))>0)*ROW(B:B),1)),\"\"))/'Time constants'!$C$8+IF(B16=B15,0,1)*'Time constants'!$C$7,\"\")","v":""},{"$f":"IF(OR(E16=\"High Resolution\",E16=\"High Flux\"),IF(E16=E15,0,1)*'Time constants'!$C$5+IF(D16=D15,0,1)*'Time constants'!$C$4,\"\")","v":""},{"$f":"IF(IF(F16=\"\",0,F16/'Time constants'!$C$6)+IF(G16=\"\",0,G16)+IF(H16=\"\",0,H16)=0,\"\",IF(F16=\"\",0,F16/'Time constants'!$C$6)+IF(G16=\"\",0,G16)+IF(H16=\"\",0,H16))","v":""},"",""]
[null,null,null,null,null,null,{"$f":"IF(IF($B17>0,$B17-INDEX($B:$B,_xlfn.AGGREGATE(14,6,1/(LEN($B$1:INDEX(B:B,ROW()-1))>0)*ROW(B:B),1)),\"\")<>\"\",     ABS(IF($B17>0,$B17-INDEX($B:$B,_xlfn.AGGREGATE(14,6,1/(LEN($B$1:INDEX(B:B,ROW()-1))>0)*ROW(B:B),1)),\"\"))/'Time constants'!$C$8+IF(B17=B16,0,1)*'Time constants'!$C$7,\"\")","v":""},{"$f":"IF(OR(E17=\"High Resolution\",E17=\"High Flux\"),IF(E17=E16,0,1)*'Time constants'!$C$5+IF(D17=D16,0,1)*'Time constants'!$C$4,\"\")","v":""},{"$f":"IF(IF(F17=\"\",0,F17/'Time constants'!$C$6)+IF(G17=\"\",0,G17)+IF(H17=\"\",0,H17)=0,\"\",IF(F17=\"\",0,F17/'Time constants'!$C$6)+IF(G17=\"\",0,G17)+IF(H17=\"\",0,H17))","v":""},"",""]
[null,null,null,null,null,null,{"$f":"IF(IF($B18>0,$B18-INDEX($B:$B,_xlfn.AGGREGATE(14,6,1/(LEN($B$1:INDEX(B:B,ROW()-1))>0)*ROW(B:B),1)),\"\")<>\"\",     ABS(IF($B18>0,$B18-INDEX($B:$B,_xlfn.AGGREGATE(14,6,1/(LEN($B$1:INDEX(B:B,ROW()-1))>0)*ROW(B:B),1)),\"\"))/'Time constants'!$C$8+IF(B18=B17,0,1)*'Time constants'!$C$7,\"\")","v":""},{"$f":"IF(OR(E18=\"High Resolution\",E18=\"High Flux\"),IF(E18=E17,0,1)*'Time constants'!$C$5+IF(D18=D17,0,1)*'Time constants'!$C$4,\"\")","v":""},{"$f":"IF(IF(F18=\"\",0,F18/'Time constants'!$C$6)+IF(G18=\"\",0,G18)+IF(H18=\"\",0,H18)=0,\"\",IF(F18=\"\",0,F18/'Time constants'!$C$6)+IF(G18=\"\",0,G18)+IF(H18=\"\",0,H18))","v":""},"",""]
[null,null,null,null,null,null,{"$f":"IF(IF($B19>0,$B19-INDEX($B:$B,_xlfn.AGGREGATE(14,6,1/(LEN($B$1:INDEX(B:B,ROW()-1))>0)*ROW(B:B),1)),\"\")<>\"\",     ABS(IF($B19>0,$B19-INDEX($B:$B,_xlfn.AGGREGATE(14,6,1/(LEN($B$1:INDEX(B:B,ROW()-1))>0)*ROW(B:B),1)),\"\"))/'Time constants'!$C$8+IF(B19=B18,0,1)*'Time constants'!$C$7,\"\")","v":""},{"$f":"IF(OR(E19=\"High Resolution\",E19=\"High Flux\"),IF(E19=E18,0,1)*'Time constants'!$C$5+IF(D19=D18,0,1)*'Time constants'!$C$4,\"\")","v":""},{"$f":"IF(IF(F19=\"\",0,F19/'Time constants'!$C$6)+IF(G19=\"\",0,G19)+IF(H19=\"\",0,H19)=0,\"\",IF(F19=\"\",0,F19/'Time constants'!$C$6)+IF(G19=\"\",0,G19)+IF(H19=\"\",0,H19))","v":""},{"$f":"IF(I19=\"\",\"\",I19/60+J18)","v":""},""]
[null,null,null,null,null,null,{"$f":"IF(IF($B20>0,$B20-INDEX($B:$B,_xlfn.AGGREGATE(14,6,1/(LEN($B$1:INDEX(B:B,ROW()-1))>0)*ROW(B:B),1)),\"\")<>\"\",     ABS(IF($B20>0,$B20-INDEX($B:$B,_xlfn.AGGREGATE(14,6,1/(LEN($B$1:INDEX(B:B,ROW()-1))>0)*ROW(B:B),1)),\"\"))/'Time constants'!$C$8+IF(B20=B19,0,1)*'Time constants'!$C$7,\"\")","v":""},{"$f":"IF(OR(E20=\"High Resolution\",E20=\"High Flux\"),IF(E20=E19,0,1)*'Time constants'!$C$5+IF(D20=D19,0,1)*'Time constants'!$C$4,\"\")","v":""},{"$f":"IF(IF(F20=\"\",0,F20/'Time constants'!$C$6)+IF(G20=\"\",0,G20)+IF(H20=\"\",0,H20)=0,\"\",IF(F20=\"\",0,F20/'Time constants'!$C$6)+IF(G20=\"\",0,G20)+IF(H20=\"\",0,H20))","v":""},"",""]
[null,null,null,null,null,null,{"$f":"IF(IF($B21>0,$B21-INDEX($B:$B,_xlfn.AGGREGATE(14,6,1/(LEN($B$1:INDEX(B:B,ROW()-1))>0)*ROW(B:B),1)),\"\")<>\"\",     ABS(IF($B21>0,$B21-INDEX($B:$B,_xlfn.AGGREGATE(14,6,1/(LEN($B$1:INDEX(B:B,ROW()-1))>0)*ROW(B:B),1)),\"\"))/'Time constants'!$C$8+IF(B21=B20,0,1)*'Time constants'!$C$7,\"\")","v":""},{"$f":"IF(OR(E21=\"High Resolution\",E21=\"High Flux\"),IF(E21=E20,0,1)*'Time constants'!$C$5+IF(D21=D20,0,1)*'Time constants'!$C$4,\"\")","v":""},{"$f":"IF(IF(F21=\"\",0,F21/'Time constants'!$C$6)+IF(G21=\"\",0,G21)+IF(H21=\"\",0,H21)=0,\"\",IF(F21=\"\",0,F21/'Time constants'!$C$6)+IF(G21=\"\",0,G21)+IF(H21=\"\",0,H21))","v":""},"",""]
[null,null,null,null,null,null,{"$f":"IF(IF($B22>0,$B22-INDEX($B:$B,_xlfn.AGGREGATE(14,6,1/(LEN($B$1:INDEX(B:B,ROW()-1))>0)*ROW(B:B),1)),\"\")<>\"\",     ABS(IF($B22>0,$B22-INDEX($B:$B,_xlfn.AGGREGATE(14,6,1/(LEN($B$1:INDEX(B:B,ROW()-1))>0)*ROW(B:B),1)),\"\"))/'Time constants'!$C$8+IF(B22=B21,0,1)*'Time constants'!$C$7,\"\")","v":""},{"$f":"IF(OR(E22=\"High Resolution\",E22=\"High Flux\"),IF(E22=E21,0,1)*'Time constants'!$C$5+IF(D22=D21,0,1)*'Time constants'!$C$4,\"\")","v":""},{"$f":"IF(IF(F22=\"\",0,F22/'Time constants'!$C$6)+IF(G22=\"\",0,G22)+IF(H22=\"\",0,H22)=0,\"\",IF(F22=\"\",0,F22/'Time constants'!$C$6)+IF(G22=\"\",0,G22)+IF(H22=\"\",0,H22))","v":""},"",""]
[null,null,null,null,null,null,{"$f":"IF(IF($B23>0,$B23-INDEX($B:$B,_xlfn.AGGREGATE(14,6,1/(LEN($B$1:INDEX(B:B,ROW()-1))>0)*ROW(B:B),1)),\"\")<>\"\",     ABS(IF($B23>0,$B23-INDEX($B:$B,_xlfn.AGGREGATE(14,6,1/(LEN($B$1:INDEX(B:B,ROW()-1))>0)*ROW(B:B),1)),\"\"))/'Time constants'!$C$8+IF(B23=B22,0,1)*'Time constants'!$C$7,\"\")","v":""},{"$f":"IF(OR(E23=\"High Resolution\",E23=\"High Flux\"),IF(E23=E22,0,1)*'Time constants'!$C$5+IF(D23=D22,0,1)*'Time constants'!$C$4,\"\")","v":""},{"$f":"IF(IF(F23=\"\",0,F23/'Time constants'!$C$6)+IF(G23=\"\",0,G23)+IF(H23=\"\",0,H23)=0,\"\",IF(F23=\"\",0,F23/'Time constants'!$C$6)+IF(G23=\"\",0,G23)+IF(H23=\"\",0,H23))","v":""},"",""]
[null,null,null,null,null,null,{"$f":"IF(IF($B24>0,$B24-INDEX($B:$B,_xlfn.AGGREGATE(14,6,1/(LEN($B$1:INDEX(B:B,ROW()-1))>0)*ROW(B:B),1)),\"\")<>\"\",     ABS(IF($B24>0,$B24-INDEX($B:$B,_xlfn.AGGREGATE(14,6,1/(LEN($B$1:INDEX(B:B,ROW()-1))>0)*ROW(B:B),1)),\"\"))/'Time constants'!$C$8+IF(B24=B23,0,1)*'Time constants'!$C$7,\"\")","v":""},{"$f":"IF(OR(E24=\"High Resolution\",E24=\"High Flux\"),IF(E24=E23,0,1)*'Time constants'!$C$5+IF(D24=D23,0,1)*'Time constants'!$C$4,\"\")","v":""},{"$f":"IF(IF(F24=\"\",0,F24/'Time constants'!$C$6)+IF(G24=\"\",0,G24)+IF(H24=\"\",0,H24)=0,\"\",IF(F24=\"\",0,F24/'Time constants'!$C$6)+IF(G24=\"\",0,G24)+IF(H24=\"\",0,H24))","v":""},"",""]
[null,null,null,null,null,null,{"$f":"IF(IF($B25>0,$B25-INDEX($B:$B,_xlfn.AGGREGATE(14,6,1/(LEN($B$1:INDEX(B:B,ROW()-1))>0)*ROW(B:B),1)),\"\")<>\"\",     ABS(IF($B25>0,$B25-INDEX($B:$B,_xlfn.AGGREGATE(14,6,1/(LEN($B$1:INDEX(B:B,ROW()-1))>0)*ROW(B:B),1)),\"\"))/'Time constants'!$C$8+IF(B25=B24,0,1)*'Time constants'!$C$7,\"\")","v":""},{"$f":"IF(OR(E25=\"High Resolution\",E25=\"High Flux\"),IF(E25=E24,0,1)*'Time constants'!$C$5+IF(D25=D24,0,1)*'Time constants'!$C$4,\"\")","v":""},{"$f":"IF(IF(F25=\"\",0,F25/'Time constants'!$C$6)+IF(G25=\"\",0,G25)+IF(H25=\"\",0,H25)=0,\"\",IF(F25=\"\",0,F25/'Time constants'!$C$6)+IF(G25=\"\",0,G25)+IF(H25=\"\",0,H25))","v":""},"",""]
[null,null,null,null,null,null,{"$f":"IF(IF($B26>0,$B26-INDEX($B:$B,_xlfn.AGGREGATE(14,6,1/(LEN($B$1:INDEX(B:B,ROW()-1))>0)*ROW(B:B),1)),\"\")<>\"\",     ABS(IF($B26>0,$B26-INDEX($B:$B,_xlfn.AGGREGATE(14,6,1/(LEN($B$1:INDEX(B:B,ROW()-1))>0)*ROW(B:B),1)),\"\"))/'Time constants'!$C$8+IF(B26=B25,0,1)*'Time constants'!$C$7,\"\")","v":""},{"$f":"IF(OR(E26=\"High Resolution\",E26=\"High Flux\"),IF(E26=E25,0,1)*'Time constants'!$C$5+IF(D26=D25,0,1)*'Time constants'!$C$4,\"\")","v":""},{"$f":"IF(IF(F26=\"\",0,F26/'Time constants'!$C$6)+IF(G26=\"\",0,G26)+IF(H26=\"\",0,H26)=0,\"\",IF(F26=\"\",0,F26/'Time constants'!$C$6)+IF(G26=\"\",0,G26)+IF(H26=\"\",0,H26))","v":""},"",""]
[null,null,null,null,null,null,{"$f":"IF(IF($B27>0,$B27-INDEX($B:$B,_xlfn.AGGREGATE(14,6,1/(LEN($B$1:INDEX(B:B,ROW()-1))>0)*ROW(B:B),1)),\"\")<>\"\",     ABS(IF($B27>0,$B27-INDEX($B:$B,_xlfn.AGGREGATE(14,6,1/(LEN($B$1:INDEX(B:B,ROW()-1))>0)*ROW(B:B),1)),\"\"))/'Time constants'!$C$8+IF(B27=B26,0,1)*'Time constants'!$C$7,\"\")","v":""},{"$f":"IF(OR(E27=\"High Resolution\",E27=\"High Flux\"),IF(E27=E26,0,1)*'Time constants'!$C$5+IF(D27=D26,0,1)*'Time constants'!$C$4,\"\")","v":""},{"$f":"IF(IF(F27=\"\",0,F27/'Time constants'!$C$6)+IF(G27=\"\",0,G27)+IF(H27=\"\",0,H27)=0,\"\",IF(F27=\"\",0,F27/'Time constants'!$C$6)+IF(G27=\"\",0,G27)+IF(H27=\"\",0,H27))","v":""},"",""]
[null,null,null,null,null,null,{"$f":"IF(IF($B28>0,$B28-INDEX($B:$B,_xlfn.AGGREGATE(14,6,1/(LEN($B$1:INDEX(B:B,ROW()-1))>0)*ROW(B:B),1)),\"\")<>\"\",     ABS(IF($B28>0,$B28-INDEX($B:$B,_xlfn.AGGREGATE(14,6,1/(LEN($B$1:INDEX(B:B,ROW()-1))>0)*ROW(B:B),1)),\"\"))/'Time constants'!$C$8+IF(B28=B27,0,1)*'Time constants'!$C$7,\"\")","v":""},{"$f":"IF(OR(E28=\"High Resolution\",E28=\"High Flux\"),IF(E28=E27,0,1)*'Time constants'!$C$5+IF(D28=D27,0,1)*'Time constants'!$C$4,\"\")","v":""},{"$f":"IF(IF(F28=\"\",0,F28/'Time constants'!$C$6)+IF(G28=\"\",0,G28)+IF(H28=\"\",0,H28)=0,\"\",IF(F28=\"\",0,F28/'Time constants'!$C$6)+IF(G28=\"\",0,G28)+IF(H28=\"\",0,H28))","v":""},"",""]
[null,null,null,null,null,null,{"$f":"IF(IF($B29>0,$B29-INDEX($B:$B,_xlfn.AGGREGATE(14,6,1/(LEN($B$1:INDEX(B:B,ROW()-1))>0)*ROW(B:B),1)),\"\")<>\"\",     ABS(IF($B29>0,$B29-INDEX($B:$B,_xlfn.AGGREGATE(14,6,1/(LEN($B$1:INDEX(B:B,ROW()-1))>0)*ROW(B:B),1)),\"\"))/'Time constants'!$C$8+IF(B29=B28,0,1)*'Time constants'!$C$7,\"\")","v":""},{"$f":"IF(OR(E29=\"High Resolution\",E29=\"High Flux\"),IF(E29=E28,0,1)*'Time constants'!$C$5+IF(D29=D28,0,1)*'Time constants'!$C$4,\"\")","v":""},{"$f":"IF(IF(F29=\"\",0,F29/'Time constants'!$C$6)+IF(G29=\"\",0,G29)+IF(H29=\"\",0,H29)=0,\"\",IF(F29=\"\",0,F29/'Time constants'!$C$6)+IF(G29=\"\",0,G29)+IF(H29=\"\",0,H29))","v":""},"",""]
[null,null,null,null,null,null,{"$f":"IF(IF($B30>0,$B30-INDEX($B:$B,_xlfn.AGGREGATE(14,6,1/(LEN($B$1:INDEX(B:B,ROW()-1))>0)*ROW(B:B),1)),\"\")<>\"\",     ABS(IF($B30>0,$B30-INDEX($B:$B,_xlfn.AGGREGATE(14,6,1/(LEN($B$1:INDEX(B:B,ROW()-1))>0)*ROW(B:B),1)),\"\"))/'Time constants'!$C$8+IF(B30=B29,0,1)*'Time constants'!$C$7,\"\")","v":""},{"$f":"IF(OR(E30=\"High Resolution\",E30=\"High Flux\"),IF(E30=E29,0,1)*'Time constants'!$C$5+IF(D30=D29,0,1)*'Time constants'!$C$4,\"\")","v":""},{"$f":"IF(IF(F30=\"\",0,F30/'Time constants'!$C$6)+IF(G30=\"\",0,G30)+IF(H30=\"\",0,H30)=0,\"\",IF(F30=\"\",0,F30/'Time constants'!$C$6)+IF(G30=\"\",0,G30)+IF(H30=\"\",0,H30))","v":""},"",""]
{"$rows_left_out":77}
{"sheet":"Time constants","index":2,"n_rows":8,"n_cols":3,"rows_kept":8,"cut":false,"hidden":false,"merged":[]}
["T"]
[]
[]
[null,"Time to change incident energy (minutes)",5]
[null,"Time to change chopper (minutes)",15]
[null,"Coulombs per minute at 1.4 MW power",{"$f":"4.9/60","v":8.1666666666666679E-2}]
[null,"Time to equilibrate temperature (minutes)",3]
[null,"Cooling & warming time, linear (K/min)",3.22]