{"text_format":"1","workbook":"xlsx","n_sheets":3,"sheets":["SAMPLES","MEASUREMENTS","Time constants"],"not_rendered":{"charts":0,"images":0,"macros":1,"external_links":0,"defined_names":1,"comments":0,"pivot_tables":0},"unopened":[],"bounds":{"document_bytes":16777216,"sheet_cells":100000,"rows_first":2000,"rows_last":500,"rows_between":2000,"halvings":0,"cell_chars":16384,"cell_head_chars":4096},"cells_cut":0,"cells_raw":0,"read":"whole","date_system":"1900"}

{"sheet":"SAMPLES","index":0,"n_rows":9,"n_cols":13,"rows_kept":9,"cut":false,"hidden":false,"merged":[]}
[]
[]
[null,"IPTS number"]
[null,"PI and PI's email"]
[null,null,null,null,"Lattice constants"]
[null,"Sample Name","Chemical Formula (e.g. H2O)","mass (g)","a (Å)","b (Å)","c (Å)","α (deg)","β (deg)","γ (deg)","Z","Solid density (g/cm^3)","ITEMS"]
[null,"Sample 1 Name"]
[null,"Sample 2 Name"]
[null,"Sample 3 Name"]

{"sheet":"MEASUREMENTS","index":1,"n_rows":106,"n_cols":12,"rows_kept":106,"cut":false,"hidden":false,"merged":[]}
[]
[]
[]
[null,null,null,null,null,null,null,null,null,"Maximum Measurement time (hours)",24]
["NOTES","Temp. (K)  (5 to 320 K)","Sample","Incident Energy (meV)","Fermi Frequency (Hz)","Detector Vessel Angle (S2, deg)","Time to measure (Coulombs)  (4.9 C/hour at 1.4 MW)","Time to set Temperature (minutes)","Time to set Config. (minutes)","Elapsed Time for commands (minutes)","Total Elapsed time (hours)","Putative Title"]
["INITIAL CONFIGURATION",290,null,25,180,-35]
["Example 1",5,"Sample 1 Name",25,240,-45,12,{"$f":"IF(IF($B7>0,$B7-INDEX($B:$B,_xlfn.AGGREGATE(14,6,1/(LEN($B$1:INDEX(B:B,ROW()-1))>0)*ROW(B:B),1)),\"\")<>\"\",     ABS(IF($B7>0,$B7-INDEX($B:$B,_xlfn.AGGREGATE(14,6,1/(LEN($B$1:INDEX(B:B,ROW()-1))>0)*ROW(B:B),1)),\"\"))/'Time constants'!$C$8+IF(B7=B6,0,1)*'Time constants'!$C$7,\"\")","v":91.509316770186331},{"$f":"IF(F7=F6,0,1)*'Time constants'!C5+IF(E7=E6,0,1)*'Time constants'!C4+IF(D7=D6,0,1)*'Time constants'!$C$4","v":10},{"$f":"IF(IF(G7=\"\",0,G7/'Time constants'!$C$6)+IF(H7=\"\",0,H7)+IF(I7=\"\",0,I7)=0,\"\",IF(G7=\"\",0,G7/'Time constants'!$C$6)+IF(H7=\"\",0,H7)+IF(I7=\"\",0,I7))","v":248.4480922803904},{"$f":"IF(J7/60=\"\",\"\",J7/60)","v":4.1408015380065066},{"$f":"IF(C7=\"\",\"\",TEXT(C7,\"0\") &\", S2 = \" & TEXT(F7,\"0\") & \"deg \" & TEXT(D7,\"0.0\") & \" meV, \" & TEXT(E7,\"0.0\") & \" Hz, \" & \"T=\" & TEXT(B7,\"0.00\") & \" K, \" &TEXT(G7,\"0.00\") & \" C\")","v":"Sample 1 Name, S2 = -45deg 25.0 meV, 240.0 Hz, T=5.00 K, 12.00 C"}]
["Example 2",5,"Sample 2 Name",25,300,-35,12,{"$f":"IF(IF($B8>0,$B8-INDEX($B:$B,_xlfn.AGGREGATE(14,6,1/(LEN($B$1:INDEX(B:B,ROW()-1))>0)*ROW(B:B),1)),\"\")<>\"\",     ABS(IF($B8>0,$B8-INDEX($B:$B,_xlfn.AGGREGATE(14,6,1/(LEN($B$1:INDEX(B:B,ROW()-1))>0)*ROW(B:B),1)),\"\"))/'Time constants'!$C$8+IF(B8=B7,0,1)*'Time constants'!$C$7,\"\")","v":0},{"$f":"IF(F8=F7,0,1)*'Time constants'!C6+IF(E8=E7,0,1)*'Time constants'!C5+IF(D8=D7,0,1)*'Time constants'!$C$4","v":5.081666666666667},{"$f":"IF(IF(G8=\"\",0,G8/'Time constants'!$C$6)+IF(H8=\"\",0,H8)+IF(I8=\"\",0,I8)=0,\"\",IF(G8=\"\",0,G8/'Time constants'!$C$6)+IF(H8=\"\",0,H8)+IF(I8=\"\",0,I8))","v":152.02044217687074},{"$f":"IF(J8=\"\",\"\",J8/60+K7)","v":6.6744755742876851},{"$f":"IF(C8=\"\",\"\",TEXT(C8,\"0\") &\", S2 = \" & TEXT(F8,\"0\") & \"deg \" & TEXT(D8,\"0.0\") & \" meV, \" & TEXT(E8,\"0.0\") & \" Hz, \" & \"T=\" & TEXT(B8,\"0.00\") & \" K, \" &TEXT(G8,\"0.00\") & \" C\")","v":"Sample 2 Name, S2 = -35deg 25.0 meV, 300.0 Hz, T=5.00 K, 12.00 C"}]
["Example 3",5,"Sample 3 Name",15,360,-60,12,{"$f":"IF(IF($B9>0,$B9-INDEX($B:$B,_xlfn.AGGREGATE(14,6,1/(LEN($B$1:INDEX(B:B,ROW()-1))>0)*ROW(B:B),1)),\"\")<>\"\",     ABS(IF($B9>0,$B9-INDEX($B:$B,_xlfn.AGGREGATE(14,6,1/(LEN($B$1:INDEX(B:B,ROW()-1))>0)*ROW(B:B),1)),\"\"))/'Time constants'!$C$8+IF(B9=B8,0,1)*'Time constants'!$C$7,\"\")","v":0},{"$f":"IF(F9=F8,0,1)*'Time constants'!C7+IF(E9=E8,0,1)*'Time constants'!C6+IF(D9=D8,0,1)*'Time constants'!$C$4","v":8.081666666666667},{"$f":"IF(IF(G9=\"\",0,G9/'Time constants'!$C$6)+IF(H9=\"\",0,H9)+IF(I9=\"\",0,I9)=0,\"\",IF(G9=\"\",0,G9/'Time constants'!$C$6)+IF(H9=\"\",0,H9)+IF(I9=\"\",0,I9))","v":155.02044217687074},9.2581496105688643,"Sample 3 Name, S2 = -60deg 15.0 meV, 360.0 Hz, T=5.00 K, 12.00 C"]
["Example 4",120,"Sample 1 Name",15,420,-60,24,{"$f":"IF(IF($B10>0,$B10-INDEX($B:$B,_xlfn.AGGREGATE(14,6,1/(LEN($B$1:INDEX(B:B,ROW()-1))>0)*ROW(B:B),1)),\"\")<>\"\",     ABS(IF($B10>0,$B10-INDEX($B:$B,_xlfn.AGGREGATE(14,6,1/(LEN($B$1:INDEX(B:B,ROW()-1))>0)*ROW(B:B),1)),\"\"))/'Time constants'!$C$8+IF(B10=B9,0,1)*'Time constants'!$C$7,\"\")","v":38.714285714285715},{"$f":"IF(F10=F9,0,1)*'Time constants'!C8+IF(E10=E9,0,1)*'Time constants'!C7+IF(D10=D9,0,1)*'Time constants'!$C$4","v":3},{"$f":"IF(IF(G10=\"\",0,G10/'Time constants'!$C$6)+IF(H10=\"\",0,H10)+IF(I10=\"\",0,I10)=0,\"\",IF(G10=\"\",0,G10/'Time constants'!$C$6)+IF(H10=\"\",0,H10)+IF(I10=\"\",0,I10))","v":335.59183673469386},14.851346889480428,"Sample 1 Name, S2 = -60deg 15.0 meV, 420.0 Hz, T=120.00 K, 24.00 C"]
["Example 5",120,"Sample 2 Name",3.8,180,-85,24,{"$f":"IF(IF($B11>0,$B11-INDEX($B:$B,_xlfn.AGGREGATE(14,6,1/(LEN($B$1:INDEX(B:B,ROW()-1))>0)*ROW(B:B),1)),\"\")<>\"\",     ABS(IF($B11>0,$B11-INDEX($B:$B,_xlfn.AGGREGATE(14,6,1/(LEN($B$1:INDEX(B:B,ROW()-1))>0)*ROW(B:B),1)),\"\"))/'Time constants'!$C$8+IF(B11=B10,0,1)*'Time constants'!$C$7,\"\")","v":0},{"$f":"IF(F11=F10,0,1)*'Time constants'!C9+IF(E11=E10,0,1)*'Time constants'!C8+IF(D11=D10,0,1)*'Time constants'!$C$4","v":8.2200000000000006},{"$f":"IF(IF(G11=\"\",0,G11/'Time constants'!$C$6)+IF(H11=\"\",0,H11)+IF(I11=\"\",0,I11)=0,\"\",IF(G11=\"\",0,G11/'Time constants'!$C$6)+IF(H11=\"\",0,H11)+IF(I11=\"\",0,I11))","v":302.09755102040816},19.886306073153897,"Sample 2 Name, S2 = -85deg 3.8 meV, 180.0 Hz, T=120.00 K, 24.00 C"]
["Example 6",120,"Sample 3 Name",3.8,240,-85,24,{"$f":"IF(IF($B12>0,$B12-INDEX($B:$B,_xlfn.AGGREGATE(14,6,1/(LEN($B$1:INDEX(B:B,ROW()-1))>0)*ROW(B:B),1)),\"\")<>\"\",     ABS(IF($B12>0,$B12-INDEX($B:$B,_xlfn.AGGREGATE(14,6,1/(LEN($B$1:INDEX(B:B,ROW()-1))>0)*ROW(B:B),1)),\"\"))/'Time constants'!$C$8+IF(B12=B11,0,1)*'Time constants'!$C$7,\"\")","v":0},{"$f":"IF(F12=F11,0,1)*'Time constants'!C10+IF(E12=E11,0,1)*'Time constants'!C9+IF(D12=D11,0,1)*'Time constants'!$C$4","v":0},{"$f":"IF(IF(G12=\"\",0,G12/'Time constants'!$C$6)+IF(H12=\"\",0,H12)+IF(I12=\"\",0,I12)=0,\"\",IF(G12=\"\",0,G12/'Time constants'!$C$6)+IF(H12=\"\",0,H12)+IF(I12=\"\",0,I12))","v":293.87755102040813},24.784265256827364,"Sample 3 Name, S2 = -85deg 3.8 meV, 240.0 Hz, T=120.00 K, 24.00 C"]
[null,null,null,null,null,null,null,{"$f":"IF(IF($B13>0,$B13-INDEX($B:$B,_xlfn.AGGREGATE(14,6,1/(LEN($B$1:INDEX(B:B,ROW()-1))>0)*ROW(B:B),1)),\"\")<>\"\",     ABS(IF($B13>0,$B13-INDEX($B:$B,_xlfn.AGGREGATE(14,6,1/(LEN($B$1:INDEX(B:B,ROW()-1))>0)*ROW(B:B),1)),\"\"))/'Time constants'!$C$8+IF(B13=B12,0,1)*'Time constants'!$C$7,\"\")","v":""},{"$f":"IF(F13=F12,0,1)*'Time constants'!C11+IF(E13=E12,0,1)*'Time constants'!C10+IF(D13=D12,0,1)*'Time constants'!$C$4","v":5},{"$f":"IF(IF(G13=\"\",0,G13/'Time constants'!$C$6)+IF(H13=\"\",0,H13)+IF(I13=\"\",0,I13)=0,\"\",IF(G13=\"\",0,G13/'Time constants'!$C$6)+IF(H13=\"\",0,H13)+IF(I13=\"\",0,I13))","v":5},24.867598590160696,""]
[null,null,null,null,null,null,null,{"$f":"IF(IF($B14>0,$B14-INDEX($B:$B,_xlfn.AGGREGATE(14,6,1/(LEN($B$1:INDEX(B:B,ROW()-1))>0)*ROW(B:B),1)),\"\")<>\"\",     ABS(IF($B14>0,$B14-INDEX($B:$B,_xlfn.AGGREGATE(14,6,1/(LEN($B$1:INDEX(B:B,ROW()-1))>0)*ROW(B:B),1)),\"\"))/'Time constants'!$C$8+IF(B14=B13,0,1)*'Time constants'!$C$7,\"\")","v":""},{"$f":"IF(F14=F13,0,1)*'Time constants'!C12+IF(E14=E13,0,1)*'Time constants'!C11+IF(D14=D13,0,1)*'Time constants'!$C$4","v":0},{"$f":"IF(IF(G14=\"\",0,G14/'Time constants'!$C$6)+IF(H14=\"\",0,H14)+IF(I14=\"\",0,I14)=0,\"\",IF(G14=\"\",0,G14/'Time constants'!$C$6)+IF(H14=\"\",0,H14)+IF(I14=\"\",0,I14))","v":""},"",""]
[null,null,null,null,null,null,null,{"$f":"IF(IF($B15>0,$B15-INDEX($B:$B,_xlfn.AGGREGATE(14,6,1/(LEN($B$1:INDEX(B:B,ROW()-1))>0)*ROW(B:B),1)),\"\")<>\"\",     ABS(IF($B15>0,$B15-INDEX($B:$B,_xlfn.AGGREGATE(14,6,1/(LEN($B$1:INDEX(B:B,ROW()-1))>0)*ROW(B:B),1)),\"\"))/'Time constants'!$C$8+IF(B15=B14,0,1)*'Time constants'!$C$7,\"\")","v":""},{"$f":"IF(F15=F14,0,1)*'Time constants'!C13+IF(E15=E14,0,1)*'Time constants'!C12+IF(D15=D14,0,1)*'Time constants'!$C$4","v":0},{"$f":"IF(IF(G15=\"\",0,G15/'Time constants'!$C$6)+IF(H15=\"\",0,H15)+IF(I15=\"\",0,I15)=0,\"\",IF(G15=\"\",0,G15/'Time constants'!$C$6)+IF(H15=\"\",0,H15)+IF(I15=\"\",0,I15))","v":""},"",""]
[null,null,null,null,null,null,null,{"$f":"IF(IF($B16>0,$B16-INDEX($B:$B,_xlfn.AGGREGATE(14,6,1/(LEN($B$1:INDEX(B:B,ROW()-1))>0)*ROW(B:B),1)),\"\")<>\"\",     ABS(IF($B16>0,$B16-INDEX($B:$B,_xlfn.AGGREGATE(14,6,1/(LEN($B$1:INDEX(B:B,ROW()-1))>0)*ROW(B:B),1)),\"\"))/'Time constants'!$C$8+IF(B16=B15,0,1)*'Time constants'!$C$7,\"\")","v":""},{"$f":"IF(OR(#REF!=\"High Resolution\",#REF!=\"High Flux\"),IF(#REF!=#REF!,0,1)*'Time constants'!#REF!+IF(D16=D15,0,1)*'Time constants'!$C$4,\"\")","v":{"$error":"#REF!"}},{"$f":"IF(IF(G16=\"\",0,G16/'Time constants'!$C$6)+IF(H16=\"\",0,H16)+IF(I16=\"\",0,I16)=0,\"\",IF(G16=\"\",0,G16/'Time constants'!$C$6)+IF(H16=\"\",0,H16)+IF(I16=\"\",0,I16))","v":{"$error":"#REF!"}},{"$error":"#REF!"},{"$f":"IF(C16=\"\",\"\",TEXT(C16,\"0\") &\", \" & TEXT(#REF!,\"0\") & \" \" & TEXT(D16,\"0.0\") & \" meV, \" & \"T=\" & TEXT(B16,\"0.00\") & \" K, \" &TEXT(G16,\"0.00\") & \"C\")","v":""}]
[null,null,null,null,null,null,null,{"$f":"IF(IF($B17>0,$B17-INDEX($B:$B,_xlfn.AGGREGATE(14,6,1/(LEN($B$1:INDEX(B:B,ROW()-1))>0)*ROW(B:B),1)),\"\")<>\"\",     ABS(IF($B17>0,$B17-INDEX($B:$B,_xlfn.AGGREGATE(14,6,1/(LEN($B$1:INDEX(B:B,ROW()-1))>0)*ROW(B:B),1)),\"\"))/'Time constants'!$C$8+IF(B17=B16,0,1)*'Time constants'!$C$7,\"\")","v":""},{"$f":"IF(OR(#REF!=\"High Resolution\",#REF!=\"High Flux\"),IF(#REF!=#REF!,0,1)*'Time constants'!#REF!+IF(D17=D16,0,1)*'Time constants'!$C$4,\"\")","v":{"$error":"#REF!"}},{"$f":"IF(IF(G17=\"\",0,G17/'Time constants'!$C$6)+IF(H17=\"\",0,H17)+IF(I17=\"\",0,I17)=0,\"\",IF(G17=\"\",0,G17/'Time constants'!$C$6)+IF(H17=\"\",0,H17)+IF(I17=\"\",0,I17))","v":{"$error":"#REF!"}},{"$error":"#REF!"},{"$f":"IF(C17=\"\",\"\",TEXT(C17,\"0\") &\", \" & TEXT(#REF!,\"0\") & \" \" & TEXT(D17,\"0.0\") & \" meV, \" & \"T=\" & TEXT(B17,\"0.00\") & \" K, \" &TEXT(G17,\"0.00\") & \"C\")","v":""}]
[null,null,null,null,null,null,null,{"$f":"IF(IF($B18>0,$B18-INDEX($B:$B,_xlfn.AGGREGATE(14,6,1/(LEN($B$1:INDEX(B:B,ROW()-1))>0)*ROW(B:B),1)),\"\")<>\"\",     ABS(IF($B18>0,$B18-INDEX($B:$B,_xlfn.AGGREGATE(14,6,1/(LEN($B$1:INDEX(B:B,ROW()-1))>0)*ROW(B:B),1)),\"\"))/'Time constants'!$C$8+IF(B18=B17,0,1)*'Time constants'!$C$7,\"\")","v":""},{"$f":"IF(OR(#REF!=\"High Resolution\",#REF!=\"High Flux\"),IF(#REF!=#REF!,0,1)*'Time constants'!#REF!+IF(D18=D17,0,1)*'Time constants'!$C$4,\"\")","v":{"$error":"#REF!"}},{"$f":"IF(IF(G18=\"\",0,G18/'Time constants'!$C$6)+IF(H18=\"\",0,H18)+IF(I18=\"\",0,I18)=0,\"\",IF(G18=\"\",0,G18/'Time constants'!$C$6)+IF(H18=\"\",0,H18)+IF(I18=\"\",0,I18))","v":{"$error":"#REF!"}},{"$error":"#REF!"},{"$f":"IF(C18=\"\",\"\",TEXT(C18,\"0\") &\", \" & TEXT(#REF!,\"0\") & \" \" & TEXT(D18,\"0.0\") & \" meV, \" & \"T=\" & TEXT(B18,\"0.00\") & \" K, \" &TEXT(G18,\"0.00\") & \"C\")","v":""}]
[null,null,null,null,null,null,null,{"$f":"IF(IF($B19>0,$B19-INDEX($B:$B,_xlfn.AGGREGATE(14,6,1/(LEN($B$1:INDEX(B:B,ROW()-1))>0)*ROW(B:B),1)),\"\")<>\"\",     ABS(IF($B19>0,$B19-INDEX($B:$B,_xlfn.AGGREGATE(14,6,1/(LEN($B$1:INDEX(B:B,ROW()-1))>0)*ROW(B:B),1)),\"\"))/'Time constants'!$C$8+IF(B19=B18,0,1)*'Time constants'!$C$7,\"\")","v":""},{"$f":"IF(OR(#REF!=\"High Resolution\",#REF!=\"High Flux\"),IF(#REF!=#REF!,0,1)*'Time constants'!#REF!+IF(D19=D18,0,1)*'Time constants'!$C$4,\"\")","v":{"$error":"#REF!"}},{"$f":"IF(IF(G19=\"\",0,G19/'Time constants'!$C$6)+IF(H19=\"\",0,H19)+IF(I19=\"\",0,I19)=0,\"\",IF(G19=\"\",0,G19/'Time constants'!$C$6)+IF(H19=\"\",0,H19)+IF(I19=\"\",0,I19))","v":{"$error":"#REF!"}},{"$f":"IF(J19=\"\",\"\",J19/60+K18)","v":{"$error":"#REF!"}},{"$f":"IF(C19=\"\",\"\",TEXT(C19,\"0\") &\", \" & TEXT(#REF!,\"0\") & \" \" & TEXT(D19,\"0.0\") & \" meV, \" & \"T=\" & TEXT(B19,\"0.00\") & \" K, \" &TEXT(G19,\"0.00\") & \"C\")","v":""}]
[null,null,null,null,null,null,null,{"$f":"IF(IF($B20>0,$B20-INDEX($B:$B,_xlfn.AGGREGATE(14,6,1/(LEN($B$1:INDEX(B:B,ROW()-1))>0)*ROW(B:B),1)),\"\")<>\"\",     ABS(IF($B20>0,$B20-INDEX($B:$B,_xlfn.AGGREGATE(14,6,1/(LEN($B$1:INDEX(B:B,ROW()-1))>0)*ROW(B:B),1)),\"\"))/'Time constants'!$C$8+IF(B20=B19,0,1)*'Time constants'!$C$7,\"\")","v":""},{"$f":"IF(OR(#REF!=\"High Resolution\",#REF!=\"High Flux\"),IF(#REF!=#REF!,0,1)*'Time constants'!#REF!+IF(D20=D19,0,1)*'Time constants'!$C$4,\"\")","v":{"$error":"#REF!"}},{"$f":"IF(IF(G20=\"\",0,G20/'Time constants'!$C$6)+IF(H20=\"\",0,H20)+IF(I20=\"\",0,I20)=0,\"\",IF(G20=\"\",0,G20/'Time constants'!$C$6)+IF(H20=\"\",0,H20)+IF(I20=\"\",0,I20))","v":{"$error":"#REF!"}},{"$error":"#REF!"},{"$f":"IF(C20=\"\",\"\",TEXT(C20,\"0\") &\", \" & TEXT(#REF!,\"0\") & \" \" & TEXT(D20,\"0.0\") & \" meV, \" & \"T=\" & TEXT(B20,\"0.00\") & \" K, \" &TEXT(G20,\"0.00\") & \"C\")","v":""}]
[null,null,null,null,null,null,null,{"$f":"IF(IF($B21>0,$B21-INDEX($B:$B,_xlfn.AGGREGATE(14,6,1/(LEN($B$1:INDEX(B:B,ROW()-1))>0)*ROW(B:B),1)),\"\")<>\"\",     ABS(IF($B21>0,$B21-INDEX($B:$B,_xlfn.AGGREGATE(14,6,1/(LEN($B$1:INDEX(B:B,ROW()-1))>0)*ROW(B:B),1)),\"\"))/'Time constants'!$C$8+IF(B21=B20,0,1)*'Time constants'!$C$7,\"\")","v":""},{"$f":"IF(OR(#REF!=\"High Resolution\",#REF!=\"High Flux\"),IF(#REF!=#REF!,0,1)*'Time constants'!#REF!+IF(D21=D20,0,1)*'Time constants'!$C$4,\"\")","v":{"$error":"#REF!"}},{"$f":"IF(IF(G21=\"\",0,G21/'Time constants'!$C$6)+IF(H21=\"\",0,H21)+IF(I21=\"\",0,I21)=0,\"\",IF(G21=\"\",0,G21/'Time constants'!$C$6)+IF(H21=\"\",0,H21)+IF(I21=\"\",0,I21))","v":{"$error":"#REF!"}},{"$error":"#REF!"},{"$f":"IF(C21=\"\",\"\",TEXT(C21,\"0\") &\", \" & TEXT(#REF!,\"0\") & \" \" & TEXT(D21,\"0.0\") & \" meV, \" & \"T=\" & TEXT(B21,\"0.00\") & \" K, \" &TEXT(G21,\"0.00\") & \"C\")","v":""}]
[null,null,null,null,null,null,null,{"$f":"IF(IF($B22>0,$B22-INDEX($B:$B,_xlfn.AGGREGATE(14,6,1/(LEN($B$1:INDEX(B:B,ROW()-1))>0)*ROW(B:B),1)),\"\")<>\"\",     ABS(IF($B22>0,$B22-INDEX($B:$B,_xlfn.AGGREGATE(14,6,1/(LEN($B$1:INDEX(B:B,ROW()-1))>0)*ROW(B:B),1)),\"\"))/'Time constants'!$C$8+IF(B22=B21,0,1)*'Time constants'!$C$7,\"\")","v":""},{"$f":"IF(OR(#REF!=\"High Resolution\",#REF!=\"High Flux\"),IF(#REF!=#REF!,0,1)*'Time constants'!#REF!+IF(D22=D21,0,1)*'Time constants'!$C$4,\"\")","v":{"$error":"#REF!"}},{"$f":"IF(IF(G22=\"\",0,G22/'Time constants'!$C$6)+IF(H22=\"\",0,H22)+IF(I22=\"\",0,I22)=0,\"\",IF(G22=\"\",0,G22/'Time constants'!$C$6)+IF(H22=\"\",0,H22)+IF(I22=\"\",0,I22))","v":{"$error":"#REF!"}},{"$error":"#REF!"},{"$f":"IF(C22=\"\",\"\",TEXT(C22,\"0\") &\", \" & TEXT(#REF!,\"0\") & \" \" & TEXT(D22,\"0.0\") & \" meV, \" & \"T=\" & TEXT(B22,\"0.00\") & \" K, \" &TEXT(G22,\"0.00\") & \"C\")","v":""}]
[null,null,null,null,null,null,null,{"$f":"IF(IF($B23>0,$B23-INDEX($B:$B,_xlfn.AGGREGATE(14,6,1/(LEN($B$1:INDEX(B:B,ROW()-1))>0)*ROW(B:B),1)),\"\")<>\"\",     ABS(IF($B23>0,$B23-INDEX($B:$B,_xlfn.AGGREGATE(14,6,1/(LEN($B$1:INDEX(B:B,ROW()-1))>0)*ROW(B:B),1)),\"\"))/'Time constants'!$C$8+IF(B23=B22,0,1)*'Time constants'!$C$7,\"\")","v":""},{"$f":"IF(OR(#REF!=\"High Resolution\",#REF!=\"High Flux\"),IF(#REF!=#REF!,0,1)*'Time constants'!#REF!+IF(D23=D22,0,1)*'Time constants'!$C$4,\"\")","v":{"$error":"#REF!"}},{"$f":"IF(IF(G23=\"\",0,G23/'Time constants'!$C$6)+IF(H23=\"\",0,H23)+IF(I23=\"\",0,I23)=0,\"\",IF(G23=\"\",0,G23/'Time constants'!$C$6)+IF(H23=\"\",0,H23)+IF(I23=\"\",0,I23))","v":{"$error":"#REF!"}},{"$error":"#REF!"},{"$f":"IF(C23=\"\",\"\",TEXT(C23,\"0\") &\", \" & TEXT(#REF!,\"0\") & \" \" & TEXT(D23,\"0.0\") & \" meV, \" & \"T=\" & TEXT(B23,\"0.00\") & \" K, \" &TEXT(G23,\"0.00\") & \"C\")","v":""}]
[null,null,null,null,null,null,null,{"$f":"IF(IF($B24>0,$B24-INDEX($B:$B,_xlfn.AGGREGATE(14,6,1/(LEN($B$1:INDEX(B:B,ROW()-1))>0)*ROW(B:B),1)),\"\")<>\"\",     ABS(IF($B24>0,$B24-INDEX($B:$B,_xlfn.AGGREGATE(14,6,1/(LEN($B$1:INDEX(B:B,ROW()-1))>0)*ROW(B:B),1)),\"\"))/'Time constants'!$C$8+IF(B24=B23,0,1)*'Time constants'!$C$7,\"\")","v":""},{"$f":"IF(OR(#REF!=\"High Resolution\",#REF!=\"High Flux\"),IF(#REF!=#REF!,0,1)*'Time constants'!#REF!+IF(D24=D23,0,1)*'Time constants'!$C$4,\"\")","v":{"$error":"#REF!"}},{"$f":"IF(IF(G24=\"\",0,G24/'Time constants'!$C$6)+IF(H24=\"\",0,H24)+IF(I24=\"\",0,I24)=0,\"\",IF(G24=\"\",0,G24/'Time constants'!$C$6)+IF(H24=\"\",0,H24)+IF(I24=\"\",0,I24))","v":{"$error":"#REF!"}},{"$error":"#REF!"},{"$f":"IF(C24=\"\",\"\",TEXT(C24,\"0\") &\", \" & TEXT(#REF!,\"0\") & \" \" & TEXT(D24,\"0.0\") & \" meV, \" & \"T=\" & TEXT(B24,\"0.00\") & \" K, \" &TEXT(G24,\"0.00\") & \"C\")","v":""}]
[null,null,null,null,null,null,null,{"$f":"IF(IF($B25>0,$B25-INDEX($B:$B,_xlfn.AGGREGATE(14,6,1/(LEN($B$1:INDEX(B:B,ROW()-1))>0)*ROW(B:B),1)),\"\")<>\"\",     ABS(IF($B25>0,$B25-INDEX($B:$B,_xlfn.AGGREGATE(14,6,1/(LEN($B$1:INDEX(B:B,ROW()-1))>0)*ROW(B:B),1)),\"\"))/'Time constants'!$C$8+IF(B25=B24,0,1)*'Time constants'!$C$7,\"\")","v":""},{"$f":"IF(OR(#REF!=\"High Resolution\",#REF!=\"High Flux\"),IF(#REF!=#REF!,0,1)*'Time constants'!#REF!+IF(D25=D24,0,1)*'Time constants'!$C$4,\"\")","v":{"$error":"#REF!"}},{"$f":"IF(IF(G25=\"\",0,G25/'Time constants'!$C$6)+IF(H25=\"\",0,H25)+IF(I25=\"\",0,I25)=0,\"\",IF(G25=\"\",0,G25/'Time constants'!$C$6)+IF(H25=\"\",0,H25)+IF(I25=\"\",0,I25))","v":{"$error":"#REF!"}},{"$error":"#REF!"},{"$f":"IF(C25=\"\",\"\",TEXT(C25,\"0\") &\", \" & TEXT(#REF!,\"0\") & \" \" & TEXT(D25,\"0.0\") & \" meV, \" & \"T=\" & TEXT(B25,\"0.00\") & \" K, \" &TEXT(G25,\"0.00\") & \"C\")","v":""}]
[null,null,null,null,null,null,null,{"$f":"IF(IF($B26>0,$B26-INDEX($B:$B,_xlfn.AGGREGATE(14,6,1/(LEN($B$1:INDEX(B:B,ROW()-1))>0)*ROW(B:B),1)),\"\")<>\"\",     ABS(IF($B26>0,$B26-INDEX($B:$B,_xlfn.AGGREGATE(14,6,1/(LEN($B$1:INDEX(B:B,ROW()-1))>0)*ROW(B:B),1)),\"\"))/'Time constants'!$C$8+IF(B26=B25,0,1)*'Time constants'!$C$7,\"\")","v":""},{"$f":"IF(OR(#REF!=\"High Resolution\",#REF!=\"High Flux\"),IF(#REF!=#REF!,0,1)*'Time constants'!#REF!+IF(D26=D25,0,1)*'Time constants'!$C$4,\"\")","v":{"$error":"#REF!"}},{"$f":"IF(IF(G26=\"\",0,G26/'Time constants'!$C$6)+IF(H26=\"\",0,H26)+IF(I26=\"\",0,I26)=0,\"\",IF(G26=\"\",0,G26/'Time constants'!$C$6)+IF(H26=\"\",0,H26)+IF(I26=\"\",0,I26))","v":{"$error":"#REF!"}},{"$error":"#REF!"},{"$f":"IF(C26=\"\",\"\",TEXT(C26,\"0\") &\", \" & TEXT(#REF!,\"0\") & \" \" & TEXT(D26,\"0.0\") & \" meV, \" & \"T=\" & TEXT(B26,\"0.00\") & \" K, \" &TEXT(G26,\"0.00\") & \"C\")","v":""}]
[null,null,null,null,null,null,null,{"$f":"IF(IF($B27>0,$B27-INDEX($B:$B,_xlfn.AGGREGATE(14,6,1/(LEN($B$1:INDEX(B:B,ROW()-1))>0)*ROW(B:B),1)),\"\")<>\"\",     ABS(IF($B27>0,$B27-INDEX($B:$B,_xlfn.AGGREGATE(14,6,1/(LEN($B$1:INDEX(B:B,ROW()-1))>0)*ROW(B:B),1)),\"\"))/'Time constants'!$C$8+IF(B27=B26,0,1)*'Time constants'!$C$7,\"\")","v":""},{"$f":"IF(OR(#REF!=\"High Resolution\",#REF!=\"High Flux\"),IF(#REF!=#REF!,0,1)*'Time constants'!#REF!+IF(D27=D26,0,1)*'Time constants'!$C$4,\"\")","v":{"$error":"#REF!"}},{"$f":"IF(IF(G27=\"\",0,G27/'Time constants'!$C$6)+IF(H27=\"\",0,H27)+IF(I27=\"\",0,I27)=0,\"\",IF(G27=\"\",0,G27/'Time constants'!$C$6)+IF(H27=\"\",0,H27)+IF(I27=\"\",0,I27))","v":{"$error":"#REF!"}},{"$error":"#REF!"},{"$f":"IF(C27=\"\",\"\",TEXT(C27,\"0\") &\", \" & TEXT(#REF!,\"0\") & \" \" & TEXT(D27,\"0.0\") & \" meV, \" & \"T=\" & TEXT(B27,\"0.00\") & \" K, \" &TEXT(G27,\"0.00\") & \"C\")","v":""}]
[null,null,null,null,null,null,null,{"$f":"IF(IF($B28>0,$B28-INDEX($B:$B,_xlfn.AGGREGATE(14,6,1/(LEN($B$1:INDEX(B:B,ROW()-1))>0)*ROW(B:B),1)),\"\")<>\"\",     ABS(IF($B28>0,$B28-INDEX($B:$B,_xlfn.AGGREGATE(14,6,1/(LEN($B$1:INDEX(B:B,ROW()-1))>0)*ROW(B:B),1)),\"\"))/'Time constants'!$C$8+IF(B28=B27,0,1)*'Time constants'!$C$7,\"\")","v":""},{"$f":"IF(OR(#REF!=\"High Resolution\",#REF!=\"High Flux\"),IF(#REF!=#REF!,0,1)*'Time constants'!#REF!+IF(D28=D27,0,1)*'Time constants'!$C$4,\"\")","v":{"$error":"#REF!"}},{"$f":"IF(IF(G28=\"\",0,G28/'Time constants'!$C$6)+IF(H28=\"\",0,H28)+IF(I28=\"\",0,I28)=0,\"\",IF(G28=\"\",0,G28/'Time constants'!$C$6)+IF(H28=\"\",0,H28)+IF(I28=\"\",0,I28))","v":{"$error":"#REF!"}},{"$error":"#REF!"},{"$f":"IF(C28=\"\",\"\",TEXT(C28,\"0\") &\", \" & TEXT(#REF!,\"0\") & \" \" & TEXT(D28,\"0.0\") & \" meV, \" & \"T=\" & TEXT(B28,\"0.00\") & \" K, \" &TEXT(G28,\"0.00\") & \"C\")","v":""}]
[null,null,null,null,null,null,null,{"$f":"IF(IF($B29>0,$B29-INDEX($B:$B,_xlfn.AGGREGATE(14,6,1/(LEN($B$1:INDEX(B:B,ROW()-1))>0)*ROW(B:B),1)),\"\")<>\"\",     ABS(IF($B29>0,$B29-INDEX($B:$B,_xlfn.AGGREGATE(14,6,1/(LEN($B$1:INDEX(B:B,ROW()-1))>0)*ROW(B:B),1)),\"\"))/'Time constants'!$C$8+IF(B29=B28,0,1)*'Time constants'!$C$7,\"\")","v":""},{"$f":"IF(OR(#REF!=\"High Resolution\",#REF!=\"High Flux\"),IF(#REF!=#REF!,0,1)*'Time constants'!#REF!+IF(D29=D28,0,1)*'Time constants'!$C$4,\"\")","v":{"$error":"#REF!"}},{"$f":"IF(IF(G29=\"\",0,G29/'Time constants'!$C$6)+IF(H29=\"\",0,H29)+IF(I29=\"\",0,I29)=0,\"\",IF(G29=\"\",0,G29/'Time constants'!$C$6)+IF(H29=\"\",0,H29)+IF(I29=\"\",0,I29))","v":{"$error":"#REF!"}},{"$error":"#REF!"},{"$f":"IF(C29=\"\",\"\",TEXT(C29,\"0\") &\", \" & TEXT(#REF!,\"0\") & \" \" & TEXT(D29,\"0.0\") & \" meV, \" & \"T=\" & TEXT(B29,\"0.00\") & \" K, \" &TEXT(G29,\"0.00\") & \"C\")","v":""}]
[null,null,null,null,null,null,null,{"$f":"IF(IF($B30>0,$B30-INDEX($B:$B,_xlfn.AGGREGATE(14,6,1/(LEN($B$1:INDEX(B:B,ROW()-1))>0)*ROW(B:B),1)),\"\")<>\"\",     ABS(IF($B30>0,$B30-INDEX($B:$B,_xlfn.AGGREGATE(14,6,1/(LEN($B$1:INDEX(B:B,ROW()-1))>0)*ROW(B:B),1)),\"\"))/'Time constants'!$C$8+IF(B30=B29,0,1)*'Time constants'!$C$7,\"\")","v":""},{"$f":"IF(OR(#REF!=\"High Resolution\",#REF!=\"High Flux\"),IF(#REF!=#REF!,0,1)*'Time constants'!#REF!+IF(D30=D29,0,1)*'Time constants'!$C$4,\"\")","v":{"$error":"#REF!"}},{"$f":"IF(IF(G30=\"\",0,G30/'Time constants'!$C$6)+IF(H30=\"\",0,H30)+IF(I30=\"\",0,I30)=0,\"\",IF(G30=\"\",0,G30/'Time constants'!$C$6)+IF(H30=\"\",0,H30)+IF(I30=\"\",0,I30))","v":{"$error":"#REF!"}},{"$error":"#REF!"},{"$f":"IF(C30=\"\",\"\",TEXT(C30,\"0\") &\", \" & TEXT(#REF!,\"0\") & \" \" & TEXT(D30,\"0.0\") & \" meV, \" & \"T=\" & TEXT(B30,\"0.00\") & \" K, \" &TEXT(G30,\"0.00\") & \"C\")","v":""}]
{"$rows_left_out":77}
{"sheet":"Time constants","index":2,"n_rows":8,"n_cols":3,"rows_kept":8,"cut":false,"hidden":false,"merged":[]}
["T"]
[]
[]
[null,"Time to change incident energy (minutes)",5]
[null,"Time to change detector vessel angle (minutes)",5]
[null,"Coulombs per minute at 1.4 MW power",{"$f":"4.9/60","v":8.1666666666666679E-2}]
[null,"Time to equilibrate temperature (minutes)",3]
[null,"Cooling & warming time, linear (K/min)",3.22]